Reaction Details
TargetProtein arginine N-methyltransferase 6
LigandBDBM50194756
Substrate/Competitorn/a
Meas. Tech.ChEMBL_1617029 (CHEMBL3859098)
IC50 970±n/a nM
Citation Shen, YSzewczyk, MMEram, MSSmil, DKaniskan, HÜde Freitas, RFSenisterra, GLi, FSchapira, MBrown, PJArrowsmith, CHBarsyte-Lovejoy, DLiu, JVedadi, MJin, J Discovery of a Potent, Selective, and Cell-Active Dual Inhibitor of Protein Arginine Methyltransferase 4 and Protein Arginine Methyltransferase 6. J Med Chem59:9124-9139 (2016) 
 
Protein arginine N-methyltransferase 6
Name:Protein arginine N-methyltransferase 6
Type:Protein
Mol. Mass.:41928.48
Organism:Homo sapiens (Human)
Description:n/a
Residue:375
BDBM50194756
NameBDBM50194756
Synonyms:CHEMBL3961701
TypeSmall organic molecule
Emp. Form.C15H24N2O
Mol. Mass.248.3639
SMILESCNCCN1CCC(CC1)OCc1ccccc1