Reaction Details
TargetProtein arginine N-methyltransferase 6
LigandBDBM50194765
Substrate/Competitorn/a
Meas. Tech.ChEMBL_1616974 (CHEMBL3859043)
IC50 64±n/a nM
Citation Shen, YSzewczyk, MMEram, MSSmil, DKaniskan, HÜde Freitas, RFSenisterra, GLi, FSchapira, MBrown, PJArrowsmith, CHBarsyte-Lovejoy, DLiu, JVedadi, MJin, J Discovery of a Potent, Selective, and Cell-Active Dual Inhibitor of Protein Arginine Methyltransferase 4 and Protein Arginine Methyltransferase 6. J Med Chem59:9124-9139 (2016) 
 
Protein arginine N-methyltransferase 6
Name:Protein arginine N-methyltransferase 6
Type:Protein
Mol. Mass.:41928.48
Organism:Homo sapiens (Human)
Description:n/a
Residue:375
BDBM50194765
NameBDBM50194765
Synonyms:CHEMBL3925764
TypeSmall organic molecule
Emp. Form.C16H23F3N2O
Mol. Mass.316.3618
SMILESCNCCN1CCC(CC1)OCc1ccccc1C(F)(F)F