Reaction Details
TargetHistone-arginine methyltransferase CARM1
LigandBDBM178103
Substrate/Competitorn/a
Meas. Tech.ChEMBL_1616970 (CHEMBL3859039)
IC50 4.0±n/a nM
Citation Shen, YSzewczyk, MMEram, MSSmil, DKaniskan, HÜde Freitas, RFSenisterra, GLi, FSchapira, MBrown, PJArrowsmith, CHBarsyte-Lovejoy, DLiu, JVedadi, MJin, J Discovery of a Potent, Selective, and Cell-Active Dual Inhibitor of Protein Arginine Methyltransferase 4 and Protein Arginine Methyltransferase 6. J Med Chem59:9124-9139 (2016) 
 
Histone-arginine methyltransferase CARM1
Name:Histone-arginine methyltransferase CARM1
Type:Protein
Mol. Mass.:65855.47
Organism:Homo sapiens (Human)
Description:Q86X55
Residue:608
BDBM178103
NameBDBM178103
Synonyms:MS023 (Compound 3) | N1-((4-(4-isopropoxyphenyl)-1H-pyrrol-3-yl)methyl)-N1-methylethane-1,2-diamine
TypeSmall organic molecule
Emp. Form.C17H25N3O
Mol. Mass.287.3999
SMILESCC(C)Oc1ccc(cc1)-c1c[nH]cc1CN(C)CCN