Reaction Details
TargetProtein arginine N-methyltransferase 3 [N508S]
LigandBDBM50194756
Substrate/Competitorn/a
Meas. Tech.ChEMBL_1616976 (CHEMBL3859045)
IC50>22000±n/a nM
Citation Shen, YSzewczyk, MMEram, MSSmil, DKaniskan, HÜde Freitas, RFSenisterra, GLi, FSchapira, MBrown, PJArrowsmith, CHBarsyte-Lovejoy, DLiu, JVedadi, MJin, J Discovery of a Potent, Selective, and Cell-Active Dual Inhibitor of Protein Arginine Methyltransferase 4 and Protein Arginine Methyltransferase 6. J Med Chem59:9124-9139 (2016) 
 
Protein arginine N-methyltransferase 3 [N508S]
Name:Protein arginine N-methyltransferase 3 [N508S]
Type:Protein
Mol. Mass.:59859.85
Organism:Homo sapiens (Human)
Description:O60678[N508S]
Residue:531
BDBM50194756
NameBDBM50194756
Synonyms:CHEMBL3961701
TypeSmall organic molecule
Emp. Form.C15H24N2O
Mol. Mass.248.3639
SMILESCNCCN1CCC(CC1)OCc1ccccc1