Reaction Details
TargetProtein arginine N-methyltransferase 6
LigandBDBM50194769
Substrate/Competitorn/a
Meas. Tech.ChEMBL_1616974 (CHEMBL3859043)
IC50 116±n/a nM
Citation Shen, YSzewczyk, MMEram, MSSmil, DKaniskan, HÜde Freitas, RFSenisterra, GLi, FSchapira, MBrown, PJArrowsmith, CHBarsyte-Lovejoy, DLiu, JVedadi, MJin, J Discovery of a Potent, Selective, and Cell-Active Dual Inhibitor of Protein Arginine Methyltransferase 4 and Protein Arginine Methyltransferase 6. J Med Chem59:9124-9139 (2016) 
 
Protein arginine N-methyltransferase 6
Name:Protein arginine N-methyltransferase 6
Type:Protein
Mol. Mass.:41928.48
Organism:Homo sapiens (Human)
Description:n/a
Residue:375
BDBM50194769
NameBDBM50194769
Synonyms:CHEMBL3964631
TypeSmall organic molecule
Emp. Form.C15H25N3
Mol. Mass.247.3791
SMILESCNCCN1CCC(CNc2ccccc2)CC1