Reaction Details
TargetCytochrome P450 2D6
LigandBDBM50196095
Substrate/Competitorn/a
Meas. Tech.ChEMBL_1618211 (CHEMBL3860380)
IC50>25000±n/a nM
Citation Lelais, GEpple, RMarsilje, THLong, YOMcNeill, MChen, BLu, WAnumolu, JBadiger, SBursulaya, BDiDonato, MFong, RJuarez, JLi, JManuia, MMason, DEGordon, PGroessl, TJohnson, KJia, YKasibhatla, SLi, CIsbell, JSpraggon, GBender, SMichellys, PY Discovery of (R,E)-N-(7-Chloro-1-(1-[4-(dimethylamino)but-2-enoyl]azepan-3-yl)-1H-benzo[d]imidazol-2-yl)-2-methylisonicotinamide (EGF816), a Novel, Potent, and WT Sparing Covalent Inhibitor of Oncogenic (L858R, ex19del) and Resistant (T790M) EGFR Mutants for the Treatment of EGFR Mutant Non-Small-Ce J Med Chem59:6671-89 (2016) 
 
Cytochrome P450 2D6
Name:Cytochrome P450 2D6
Type:Protein
Mol. Mass.:55774.82
Organism:Homo sapiens (Human)
Description:P10635
Residue:497
BDBM50196095
NameBDBM50196095
Synonyms:CHEMBL3972316
TypeSmall organic molecule
Emp. Form.C25H25F3N4O2
Mol. Mass.470.4868
SMILESCc1cccc2nc(NC(=O)c3cccc(c3)C(F)(F)F)n([C@@H]3CCCCN(C3)C(=O)C=C)c12