Reaction Details
TargetTyrosine-protein kinase BTK
LigandBDBM50388180
Substrate/Competitorn/a
Meas. Tech.ChEMBL_1623367 (CHEMBL3865719)
IC50 8.2±n/a nM
Citation Pujala, BAgarwal, AKMiddya, SBanerjee, MSurya, ANayak, AKGupta, AKhare, SGuguloth, RRandive, NAShinde, BUThakur, APatel, DIRaja, MGreen, MJAlfaro, JAvila, PPérez de Arce, FAlmirez, RGKanno, SBernales, SHung, DTChakravarty, SMcCullagh, EQuinn, KPRai, RPham, SM Discovery of Pyrazolopyrimidine Derivatives as Novel Dual Inhibitors of BTK and PI3Kd. ACS Med Chem Lett7:1161-1166 (2016) 
 
Tyrosine-protein kinase BTK
Name:Tyrosine-protein kinase BTK
Type:Enzyme
Mol. Mass.:76289.95
Organism:Homo sapiens (Human)
Description:Q06187
Residue:659
BDBM50388180
NameBDBM50388180
Synonyms:CHEMBL2057912
TypeSmall organic molecule
Emp. Form.C22H21N5O
Mol. Mass.371.435
SMILESNc1ncnc2n(nc(-c3ccc(Oc4ccccc4)cc3)c12)C1CCCC1