Reaction Details
TargetPhosphatidylinositol 4,5-bisphosphate 3-kinase catalytic subunit beta isoform
LigandBDBM50203696
Substrate/Competitorn/a
Meas. Tech.ChEMBL_1625830 (CHEMBL3868299)
IC50 1780±n/a nM
Citation Hoegenauer, KSoldermann, NHebach, CHollingworth, GJLewis, Ivon Matt, ASmith, ABWolf, RMWilcken, RHaasen, DBurkhart, CZécri, F Discovery of novel pyrrolidineoxy-substituted heteroaromatics as potent and selective PI3K delta inhibitors with improved physicochemical properties. Bioorg Med Chem Lett26:5657-5662 (2016) 
 
Phosphatidylinositol 4,5-bisphosphate 3-kinase catalytic subunit beta isoform
Name:Phosphatidylinositol 4,5-bisphosphate 3-kinase catalytic subunit beta isoform
Type:Enzyme Subunit
Mol. Mass.:122769.00
Organism:Homo sapiens (Human)
Description:P42338
Residue:1070
BDBM50203696
NameBDBM50203696
Synonyms:CHEMBL3896413
TypeSmall organic molecule
Emp. Form.C21H22N4O3
Mol. Mass.378.4244
SMILESCCC(=O)N1CC[C@@H](C1)Oc1ncnc2ccc(cc12)-c1ccc(OC)nc1