Reaction Details
TargetPhosphatidylinositol 4,5-bisphosphate 3-kinase catalytic subunit delta isoform
LigandBDBM50203701
Substrate/Competitorn/a
Meas. Tech.ChEMBL_1625831 (CHEMBL3868300)
IC50 39±n/a nM
Citation Hoegenauer, KSoldermann, NHebach, CHollingworth, GJLewis, Ivon Matt, ASmith, ABWolf, RMWilcken, RHaasen, DBurkhart, CZécri, F Discovery of novel pyrrolidineoxy-substituted heteroaromatics as potent and selective PI3K delta inhibitors with improved physicochemical properties. Bioorg Med Chem Lett26:5657-5662 (2016) 
 
Phosphatidylinositol 4,5-bisphosphate 3-kinase catalytic subunit delta isoform
Name:Phosphatidylinositol 4,5-bisphosphate 3-kinase catalytic subunit delta isoform
Type:Enzyme Subunit
Mol. Mass.:119489.41
Organism:Homo sapiens (Human)
Description:O00329
Residue:1044
BDBM50203701
NameBDBM50203701
Synonyms:CHEMBL3944013
TypeSmall organic molecule
Emp. Form.C29H28N4O4
Mol. Mass.496.557
SMILESCOc1ccc(cc1OC)-c1ccc2ncnc(-c3cccc(c3)C(=O)N3CCN(CC3)C(C)=O)c2c1