Reaction Details
TargetOxysterols receptor LXR-beta/Retinoic acid receptor RXR-alpha
LigandBDBM50204078
Substrate/Competitorn/a
Meas. Tech.ChEMBL_1626045 (CHEMBL3868514)
Ki 18±n/a nM
Citation Kick, EKBusch, BBMartin, RStevens, WCBollu, VXie, YBoren, BCNyman, MCNanao, MHNguyen, LPlonowski, ASchulman, IGYan, GZhang, HHou, XValente, MNNarayanan, RBehnia, KRodrigues, ADBrock, BSmalley, JCantor, GHLupisella, JSleph, PGrimm, DOstrowski, JWexler, RRKirchgessner, TMohan, R Discovery of Highly Potent Liver X Receptorß Agonists. ACS Med Chem Lett7:1207-1212 (2016) 
 
Oxysterols receptor LXR-beta/Retinoic acid receptor RXR-alpha
Name:Oxysterols receptor LXR-beta/Retinoic acid receptor RXR-alpha
Synonyms:Retinoic acid receptor RXR-alpha/oxysterols receptor LXR-beta
Type:n/a
Mol. Mass.:n/a
Description:ASSAY_ID of ChEMBL is 2032722
Components:This complex has 2 components.
Component 1
Name:Retinoic acid receptor RXR-alpha
Type:PROTEIN
Mol. Mass.:50820.38
Organism:Homo sapiens (Human)
Description:ChEMBL_1456363
Residue:462
Component 2
Name:Oxysterols receptor LXR-beta
Synonyms:LXRB Liver X, LXR beta NR1H2 Nuclear receptor NER Ubiquitously-expressed nuclear receptor
Type:Enzyme Catalytic Domain
Mol. Mass.:50978.79
Organism:Homo sapiens (Human)
Description:P55055
Residue:460
BDBM50204078
NameBDBM50204078
Synonyms:CHEMBL3926292
TypeSmall organic molecule
Emp. Form.C29H29ClF2N2O4S
Mol. Mass.575.066
SMILESCC(C)(O)c1cn(c(n1)C(C)(C)c1ccccc1Cl)-c1ccc(cc1F)-c1cc(F)c(CO)c(c1)S(C)(=O)=O