Reaction Details
TargetOxysterols receptor LXR-beta
LigandBDBM50204073
Substrate/Competitorn/a
Meas. Tech.ChEMBL_1626044 (CHEMBL3868513)
EC50 20±n/a nM
Citation Kick, EKBusch, BBMartin, RStevens, WCBollu, VXie, YBoren, BCNyman, MCNanao, MHNguyen, LPlonowski, ASchulman, IGYan, GZhang, HHou, XValente, MNNarayanan, RBehnia, KRodrigues, ADBrock, BSmalley, JCantor, GHLupisella, JSleph, PGrimm, DOstrowski, JWexler, RRKirchgessner, TMohan, R Discovery of Highly Potent Liver X Receptorß Agonists. ACS Med Chem Lett7:1207-1212 (2016) 
 
Oxysterols receptor LXR-beta
Name:Oxysterols receptor LXR-beta
Type:Enzyme Catalytic Domain
Mol. Mass.:50978.79
Organism:Homo sapiens (Human)
Description:P55055
Residue:460
BDBM50204073
NameBDBM50204073
Synonyms:CHEMBL3917300
TypeSmall organic molecule
Emp. Form.C29H28ClF3N2O4S
Mol. Mass.593.057
SMILESCC(C)(O)c1cn(c(n1)C(C)(C)c1c(F)cccc1Cl)-c1ccc(cc1F)-c1cc(F)c(CO)c(c1)S(C)(=O)=O