Reaction Details
TargetOxysterols receptor LXR-beta
LigandBDBM50204085
Substrate/Competitorn/a
Meas. Tech.ChEMBL_1626048 (CHEMBL3868517)
EC50 9.0±n/a nM
Citation Kick, EKBusch, BBMartin, RStevens, WCBollu, VXie, YBoren, BCNyman, MCNanao, MHNguyen, LPlonowski, ASchulman, IGYan, GZhang, HHou, XValente, MNNarayanan, RBehnia, KRodrigues, ADBrock, BSmalley, JCantor, GHLupisella, JSleph, PGrimm, DOstrowski, JWexler, RRKirchgessner, TMohan, R Discovery of Highly Potent Liver X Receptorß Agonists. ACS Med Chem Lett7:1207-1212 (2016) 
 
Oxysterols receptor LXR-beta
Name:Oxysterols receptor LXR-beta
Type:Enzyme Catalytic Domain
Mol. Mass.:50978.79
Organism:Homo sapiens (Human)
Description:P55055
Residue:460
BDBM50204085
NameBDBM50204085
Synonyms:CHEMBL3960606
TypeSmall organic molecule
Emp. Form.C27H27ClN2O4S
Mol. Mass.511.032
SMILESCC(C)(O)c1cn(c(Cc2ccccc2Cl)n1)-c1ccc(cc1)-c1ccc(CO)c(c1)S(C)(=O)=O