Reaction Details
TargetOxysterols receptor LXR-beta
LigandBDBM50204078
Substrate/Competitorn/a
Meas. Tech.ChEMBL_1626044 (CHEMBL3868513)
EC50 50±n/a nM
Citation Kick, EKBusch, BBMartin, RStevens, WCBollu, VXie, YBoren, BCNyman, MCNanao, MHNguyen, LPlonowski, ASchulman, IGYan, GZhang, HHou, XValente, MNNarayanan, RBehnia, KRodrigues, ADBrock, BSmalley, JCantor, GHLupisella, JSleph, PGrimm, DOstrowski, JWexler, RRKirchgessner, TMohan, R Discovery of Highly Potent Liver X Receptorß Agonists. ACS Med Chem Lett7:1207-1212 (2016) 
 
Oxysterols receptor LXR-beta
Name:Oxysterols receptor LXR-beta
Type:Enzyme Catalytic Domain
Mol. Mass.:50978.79
Organism:Homo sapiens (Human)
Description:P55055
Residue:460
BDBM50204078
NameBDBM50204078
Synonyms:CHEMBL3926292
TypeSmall organic molecule
Emp. Form.C29H29ClF2N2O4S
Mol. Mass.575.066
SMILESCC(C)(O)c1cn(c(n1)C(C)(C)c1ccccc1Cl)-c1ccc(cc1F)-c1cc(F)c(CO)c(c1)S(C)(=O)=O