Reaction Details
TargetATP-sensitive inward rectifier potassium channel 1
LigandBDBM196061
Substrate/Competitorn/a
Meas. Tech.ChEBML_1627126
IC50 100±n/a nM
Citation Zhu, Yde Jesus, RKTang, HWalsh, SPJiang, JGu, XTeumelsan, NShahripour, APio, BDing, FXHa, SPriest, BTSwensen, AMAlonso-Galicia, MFelix, JPBrochu, RMBailey, TThomas-Fowlkes, BZhou, XPai, LYHampton, CHernandez, MOwens, KEhrhart, JRoy, SKaczorowski, GJYang, LParmee, ERSullivan, KGarcia, MLPasternak, A Discovery of a potent and selective ROMK inhibitor with improved pharmacokinetic properties based on an octahydropyrazino[2,1-c][1,4]oxazine scaffold. Bioorg Med Chem Lett26:5695-5702 (2016) 
 
ATP-sensitive inward rectifier potassium channel 1
Name:ATP-sensitive inward rectifier potassium channel 1
Type:Enzyme Catalytic Domain
Mol. Mass.:44809.08
Organism:Homo sapiens (Human)
Description:gi_223460826
Residue:391
BDBM196061
NameBDBM196061
Synonyms:US9206199, 166
TypeSmall organic molecule
Emp. Form.C24H25N7O3S
Mol. Mass.491.565
SMILESCc1c2COC(=O)c2ccc1[C@@H]1CN2CCN(C[C@H]2CS1)C(=O)Cc1ccc(nc1)-n1cnnn1