Reaction Details
TargetATP-sensitive inward rectifier potassium channel 1
LigandBDBM196074
Substrate/Competitorn/a
Meas. Tech.ChEMBL_1627126 (CHEMBL3869647)
IC50 45±n/a nM
Citation Zhu, Yde Jesus, RKTang, HWalsh, SPJiang, JGu, XTeumelsan, NShahripour, APio, BDing, FXHa, SPriest, BTSwensen, AMAlonso-Galicia, MFelix, JPBrochu, RMBailey, TThomas-Fowlkes, BZhou, XPai, LYHampton, CHernandez, MOwens, KEhrhart, JRoy, SKaczorowski, GJYang, LParmee, ERSullivan, KGarcia, MLPasternak, A Discovery of a potent and selective ROMK inhibitor with improved pharmacokinetic properties based on an octahydropyrazino[2,1-c][1,4]oxazine scaffold. Bioorg Med Chem Lett26:5695-5702 (2016) 
 
ATP-sensitive inward rectifier potassium channel 1
Name:ATP-sensitive inward rectifier potassium channel 1
Type:Enzyme Catalytic Domain
Mol. Mass.:44809.08
Organism:Homo sapiens (Human)
Description:gi_223460826
Residue:391
BDBM196074
NameBDBM196074
Synonyms:US9206199, 179
TypeSmall organic molecule
Emp. Form.C21H21N9O3
Mol. Mass.447.4499
SMILESO=C(Cc1ccc(nc1)-n1cnnn1)N1CCN2C[C@H](OC[C@@H]2C1)c1ccc2nonc2c1