Reaction Details
TargetSodium channel protein type 5 subunit alpha
LigandBDBM50204281
Substrate/Competitorn/a
Meas. Tech.ChEMBL_1627134 (CHEMBL3869655)
IC50>30000±n/a nM
Citation Zhu, Yde Jesus, RKTang, HWalsh, SPJiang, JGu, XTeumelsan, NShahripour, APio, BDing, FXHa, SPriest, BTSwensen, AMAlonso-Galicia, MFelix, JPBrochu, RMBailey, TThomas-Fowlkes, BZhou, XPai, LYHampton, CHernandez, MOwens, KEhrhart, JRoy, SKaczorowski, GJYang, LParmee, ERSullivan, KGarcia, MLPasternak, A Discovery of a potent and selective ROMK inhibitor with improved pharmacokinetic properties based on an octahydropyrazino[2,1-c][1,4]oxazine scaffold. Bioorg Med Chem Lett26:5695-5702 (2016) 
 
Sodium channel protein type 5 subunit alpha
Name:Sodium channel protein type 5 subunit alpha
Type:Enzyme
Mol. Mass.:226908.60
Organism:Homo sapiens (Human)
Description:Q14524
Residue:2016
BDBM50204281
NameBDBM50204281
Synonyms:CHEMBL3933749
TypeSmall organic molecule
Emp. Form.C23H23FN8O2
Mol. Mass.462.4795
SMILES[H][C@]12CO[C@@H](CN1CCN(C2)C(=O)Cc1ccc(cn1)-n1cnnn1)c1ccc(F)c(C#N)c1C