Reaction Details
TargetPotassium voltage-gated channel subfamily H member 2
LigandBDBM50204274
Substrate/Competitorn/a
Meas. Tech.ChEMBL_1627129 (CHEMBL3869650)
IC50 10000±n/a nM
Citation Zhu, Yde Jesus, RKTang, HWalsh, SPJiang, JGu, XTeumelsan, NShahripour, APio, BDing, FXHa, SPriest, BTSwensen, AMAlonso-Galicia, MFelix, JPBrochu, RMBailey, TThomas-Fowlkes, BZhou, XPai, LYHampton, CHernandez, MOwens, KEhrhart, JRoy, SKaczorowski, GJYang, LParmee, ERSullivan, KGarcia, MLPasternak, A Discovery of a potent and selective ROMK inhibitor with improved pharmacokinetic properties based on an octahydropyrazino[2,1-c][1,4]oxazine scaffold. Bioorg Med Chem Lett26:5695-5702 (2016) 
 
Potassium voltage-gated channel subfamily H member 2
Name:Potassium voltage-gated channel subfamily H member 2
Type:Multi-pass membrane protein
Mol. Mass.:126672.65
Organism:Homo sapiens (Human)
Description:Q12809
Residue:1159
BDBM50204274
NameBDBM50204274
Synonyms:CHEMBL3911740
TypeSmall organic molecule
Emp. Form.C23H23FN8O2
Mol. Mass.462.4795
SMILES[H][C@]12CO[C@@H](CN1CCN(C2)C(=O)Cc1ccc(nc1)-n1cnnn1)c1ccc(F)c(C#N)c1C