Reaction Details
TargetCoagulation factor VII/Tissue factor
LigandBDBM50205818
Substrate/Competitorn/a
Meas. Tech.ChEMBL_1628566 (CHEMBL3871151)
Ki 18±n/a nM
Citation Richter, JMCheney, DLBates, JAWei, ALuettgen, JMRendina, ARHarper, TMNarayanan, RWong, PCSeiffert, DWexler, RRPriestley, ES Design and Synthesis of Novel Meta-Linked Phenylglycine Macrocyclic FVIIa Inhibitors. ACS Med Chem Lett8:67-72 (2017) 
 
Coagulation factor VII/Tissue factor
Name:Coagulation factor VII/Tissue factor
Type:n/a
Mol. Mass.:n/a
Description:ASSAY_ID of EBI is 69535
Components:This complex has 2 components.
Component 1
Name:Tissue factor
Synonyms:CD_antigen=CD142 Coagulation factor VII/tissue factor TF Thromboplastin | Tissue factor
Type:PROTEIN
Mol. Mass.:33067.61
Organism:Homo sapiens (Human)
Description:ChEMBL_936735
Residue:295
Component 2
Name:Coagulation factor VII
Synonyms:Eptacog alfa FA7_HUMAN Factor VIIa (fVIIa) SPCA serum prothrombin conversion accelerator
Type:Enzyme
Mol. Mass.:51599.89
Organism:Homo sapiens (Human)
Description:n/a
Residue:466
BDBM50205818
NameBDBM50205818
Synonyms:CHEMBL3889510
TypeSmall organic molecule
Emp. Form.C32H32FN5O5S
Mol. Mass.617.69
SMILESCOc1ccc2cc1CCC(=O)Nc1ccc(c(CN(C)C(=O)[C@@H]2Nc2ccc3c(N)ncc(F)c3c2)c1)S(=O)(=O)C1CC1