Reaction Details
TargetCoagulation factor VII/Tissue factor
LigandBDBM50205837
Substrate/Competitorn/a
Meas. Tech.ChEMBL_1628566 (CHEMBL3871151)
Ki 260±n/a nM
Citation Richter, JMCheney, DLBates, JAWei, ALuettgen, JMRendina, ARHarper, TMNarayanan, RWong, PCSeiffert, DWexler, RRPriestley, ES Design and Synthesis of Novel Meta-Linked Phenylglycine Macrocyclic FVIIa Inhibitors. ACS Med Chem Lett8:67-72 (2017) 
 
Coagulation factor VII/Tissue factor
Name:Coagulation factor VII/Tissue factor
Type:n/a
Mol. Mass.:n/a
Description:ASSAY_ID of EBI is 69535
Components:This complex has 2 components.
Component 1
Name:Tissue factor
Synonyms:CD_antigen=CD142 Coagulation factor VII/tissue factor TF Thromboplastin | Tissue factor
Type:PROTEIN
Mol. Mass.:33067.61
Organism:Homo sapiens (Human)
Description:ChEMBL_936735
Residue:295
Component 2
Name:Coagulation factor VII
Synonyms:Eptacog alfa FA7_HUMAN Factor VIIa (fVIIa) SPCA serum prothrombin conversion accelerator
Type:Enzyme
Mol. Mass.:51599.89
Organism:Homo sapiens (Human)
Description:n/a
Residue:466
BDBM50205837
NameBDBM50205837
Synonyms:CHEMBL3933476
TypeSmall organic molecule
Emp. Form.C31H30FN5O4S
Mol. Mass.587.664
SMILESCN1Cc2cc(NC(=O)CCc3cccc(c3)[C@@H](Nc3ccc4c(N)ncc(F)c4c3)C1=O)ccc2S(=O)(=O)C1CC1