Reaction Details
TargetAurora kinase B
LigandBDBM50206406
Substrate/Competitorn/a
Meas. Tech.ChEMBL_1628980 (CHEMBL3871606)
IC50 28±n/a nM
Citation Chang, CFLin, WHKe, YYLin, YSWang, WCChen, CHKuo, PCHsu, JTAUang, BJHsieh, HP Discovery of novel inhibitors of Aurora kinases with indazole scaffold: In silico fragment-based and knowledge-based drug design. Eur J Med Chem124:186-199 (2016) 
 
Aurora kinase B
Name:Aurora kinase B
Type:Protein
Mol. Mass.:39327.72
Organism:Homo sapiens (Human)
Description:Q96GD4
Residue:344
BDBM50206406
NameBDBM50206406
Synonyms:CHEMBL3975342
TypeSmall organic molecule
Emp. Form.C23H20N4O5S
Mol. Mass.464.494
SMILESOC(=O)CCC(=O)Nc1cccc(c1)-c1n[nH]c2ccc(NS(=O)(=O)c3ccccc3)cc12