Reaction Details
TargetAurora kinase A
LigandBDBM50206416
Substrate/Competitorn/a
Meas. Tech.ChEMBL_1628978 (CHEMBL3871604)
IC50 85±n/a nM
Citation Chang, CFLin, WHKe, YYLin, YSWang, WCChen, CHKuo, PCHsu, JTAUang, BJHsieh, HP Discovery of novel inhibitors of Aurora kinases with indazole scaffold: In silico fragment-based and knowledge-based drug design. Eur J Med Chem124:186-199 (2016) 
 
Aurora kinase A
Name:Aurora kinase A
Type:Serine/threonine-protein kinase
Mol. Mass.:45830.98
Organism:Homo sapiens (Human)
Description:O14965
Residue:403
BDBM50206416
NameBDBM50206416
Synonyms:CHEMBL3953964
TypeSmall organic molecule
Emp. Form.C23H18N4O3S
Mol. Mass.430.479
SMILESCC#CC(=O)Nc1cccc(c1)-c1n[nH]c2ccc(NS(=O)(=O)c3ccccc3)cc12