Reaction Details
TargetNeuronal acetylcholine receptor subunit alpha-7
LigandBDBM50211203
Substrate/Competitorn/a
Meas. Tech.ChEMBL_1636027 (CHEMBL3878925)
EC50 320±n/a nM
Citation Cook, JZusi, FCMcDonald, IMKing, DHill, MDIwuagwu, CMate, RAFang, HZhao, RWang, BCutrone, JMa, BGao, QKnox, RJMatchett, MGallagher, LFerrante, MPost-Munson, DMolski, TEaston, AMiller, RJones, KDigavalli, SHealy, FLentz, KBenitex, YClarke, WNatale, JSiuciak, JALodge, NZaczek, RDenton, RMorgan, DBristow, LJMacor, JEOlson, RE Design and Synthesis of a New Series of 4-Heteroarylamino-1'-azaspiro[oxazole-5,3'-bicyclo[2.2.2]octanes asa7 Nicotinic Receptor Agonists. 1. Development of Pharmacophore and Early Structure-Activity Relationship. J Med Chem59:11171-11181 (2016) 
 
Neuronal acetylcholine receptor subunit alpha-7
Name:Neuronal acetylcholine receptor subunit alpha-7
Type:Enzyme
Mol. Mass.:56502.44
Organism:Rattus norvegicus (Rat)
Description:Q05941
Residue:502
BDBM50211203
NameBDBM50211203
Synonyms:CHEMBL3980382
TypeSmall organic molecule
Emp. Form.C18H22N4O2S
Mol. Mass.358.458
SMILESCCOc1ccc2nc(NC3=NCC4(CN5CCC4CC5)O3)sc2c1