Reaction Details
TargetAcetylcholine receptor subunit delta
LigandBDBM50211195
Substrate/Competitorn/a
Meas. Tech.ChEMBL_1636037 (CHEMBL3878935)
EC50>100000±n/a nM
Citation Cook, JZusi, FCMcDonald, IMKing, DHill, MDIwuagwu, CMate, RAFang, HZhao, RWang, BCutrone, JMa, BGao, QKnox, RJMatchett, MGallagher, LFerrante, MPost-Munson, DMolski, TEaston, AMiller, RJones, KDigavalli, SHealy, FLentz, KBenitex, YClarke, WNatale, JSiuciak, JALodge, NZaczek, RDenton, RMorgan, DBristow, LJMacor, JEOlson, RE Design and Synthesis of a New Series of 4-Heteroarylamino-1'-azaspiro[oxazole-5,3'-bicyclo[2.2.2]octanes asa7 Nicotinic Receptor Agonists. 1. Development of Pharmacophore and Early Structure-Activity Relationship. J Med Chem59:11171-11181 (2016) 
 
Acetylcholine receptor subunit delta
Name:Acetylcholine receptor subunit delta
Type:PROTEIN
Mol. Mass.:58877.21
Organism:Rattus norvegicus
Description:ChEMBL_117053
Residue:517
BDBM50211195
NameBDBM50211195
Synonyms:CHEMBL3944506
TypeSmall organic molecule
Emp. Form.C17H20N4O2S
Mol. Mass.344.431
SMILESCOc1ccc2nc(NC3=NC[C@@]4(CN5CCC4CC5)O3)sc2c1