Reaction Details
TargetLeukotriene B4 receptor 1/2
LigandBDBM50215737
Substrate/Competitorn/a
Meas. Tech.ChEMBL_98510 (CHEMBL709172)
IC50 8.00±n/a nM
Citation Reiter, LAKoch, KPiscopio, ADShowell, HJAlpert, RBiggers, MSChambers, RJConklyn, MJCooper, KCortina, SRDibrino, JNDominy, BWFarrell, CAHingorani, GPMartinelli, GJRamchandani, MWright, KF trans-3-Benzyl-4-hydroxy-7-chromanylbenzoic acid derivatives as antagonists of the leukotriene B4 (LTB4) receptor. Bioorg Med Chem Lett8:1781-6 (1998) Leukotriene B4 receptor 1/2
Name:Leukotriene B4 receptor 1/2
Synonyms:Leukotriene B4 receptor
Type:n/a
Mol. Mass.:n/a
Description:ASSAY_ID of ChEMBL is 88360
Components:This complex has 2 components.
Component 1
Name:Leukotriene B4 receptor 2
Type:Enzyme Catalytic Domain
Mol. Mass.:37964.86
Organism:Homo sapiens (Human)
Description:Leukotriene 2 0 HUMAN::Q9NPC1
Residue:358
Component 2
Name:Leukotriene B4 receptor 1
Synonyms:BLT BLTR Chemoattractant receptor-like 1 GPR16 LTB4-R 1 Leukotriene B4 R1 Leukotriene B4 receptor 1 P2Y purinoceptor 7 | P2Y7
Type:Enzyme Catalytic Domain
Mol. Mass.:37582.68
Organism:Homo sapiens (Human)
Description:Q15722
Residue:352
BDBM50215737
NameBDBM50215737
Synonyms:CHEMBL50425
TypeSmall organic molecule
Emp. Form.C29H23ClO4
Mol. Mass.470.944
SMILESO[C@@H]1[C@@H](Cc2ccc(cc2)-c2ccccc2)COc2cc(ccc12)-c1cc(Cl)ccc1C(O)=O