Reaction Details
TargetHistamine H2 receptor
LigandBDBM50220106
Substrate/Competitorn/a
Meas. Tech.ChEBML_85661
Ki 8318±n/a nM
Citation Faghih, RDwight, WGentles, RPhelan, KEsbenshade, TAIreland, LMiller, TRKang, CHFox, GBGopalakrishnan, SMHancock, AABennani, YL Structure-activity relationships of non-imidazole H(3) receptor ligands. Part 1. Bioorg Med Chem Lett12:2031-4 (2002) Histamine H2 receptor
Name:Histamine H2 receptor
Type:G Protein-Coupled Receptor (GPCR)
Mol. Mass.:40115.31
Organism:Homo sapiens (Human)
Description:n/a
Residue:359
BDBM50220106
NameBDBM50220106
Synonyms:CHEMBL418691
TypeSmall organic molecule
Emp. Form.C24H30N2O5
Mol. Mass.426.5054
SMILESCCOC(=O)N1CCN(CCCOc2ccc(cc2)C(=O)c2ccc(OC)cc2)CC1