Reaction Details
TargetHistamine H2 receptor
LigandBDBM50220112
Substrate/Competitorn/a
Meas. Tech.ChEBML_85661
Ki 3715±n/a nM
Citation Faghih, RDwight, WGentles, RPhelan, KEsbenshade, TAIreland, LMiller, TRKang, CHFox, GBGopalakrishnan, SMHancock, AABennani, YL Structure-activity relationships of non-imidazole H(3) receptor ligands. Part 1. Bioorg Med Chem Lett12:2031-4 (2002) Histamine H2 receptor
Name:Histamine H2 receptor
Type:G Protein-Coupled Receptor (GPCR)
Mol. Mass.:40115.31
Organism:Homo sapiens (Human)
Description:n/a
Residue:359
BDBM50220112
NameBDBM50220112
Synonyms:CHEMBL64775
TypeSmall organic molecule
Emp. Form.C24H38N2O4
Mol. Mass.418.5695
SMILESCCCCCC(=O)c1ccc(OCCCN2CCN(CC2)C(=O)OCC(C)C)cc1