Reaction Details
TargetHistamine H2 receptor
LigandBDBM50220104
Substrate/Competitorn/a
Meas. Tech.ChEBML_85661
Ki 25119±n/a nM
Citation Faghih, RDwight, WGentles, RPhelan, KEsbenshade, TAIreland, LMiller, TRKang, CHFox, GBGopalakrishnan, SMHancock, AABennani, YL Structure-activity relationships of non-imidazole H(3) receptor ligands. Part 1. Bioorg Med Chem Lett12:2031-4 (2002) Histamine H2 receptor
Name:Histamine H2 receptor
Type:G Protein-Coupled Receptor (GPCR)
Mol. Mass.:40115.31
Organism:Homo sapiens (Human)
Description:n/a
Residue:359
BDBM50220104
NameBDBM50220104
Synonyms:CHEMBL444307
TypeSmall organic molecule
Emp. Form.C24H29N3O4
Mol. Mass.423.5048
SMILESCCOC(=O)N1CCN(CCCOc2ccc(cc2)C(=O)\C=C\c2cccnc2)CC1