Reaction Details
TargetHistamine H3 receptor
LigandBDBM50220142
Substrate/Competitorn/a
Meas. Tech.ChEBML_87054
Ki 5.4±n/a nM
Citation Faghih, RDwight, WGentles, RPhelan, KEsbenshade, TAIreland, LMiller, TRKang, CHFox, GBGopalakrishnan, SMHancock, AABennani, YL Structure-activity relationships of non-imidazole H(3) receptor ligands. Part 1. Bioorg Med Chem Lett12:2031-4 (2002) Histamine H3 receptor
Name:Histamine H3 receptor
Type:G Protein-Coupled Receptor (GPCR)
Mol. Mass.:48607.98
Organism:Rattus norvegicus (rat)
Description:n/a
Residue:445
BDBM50220142
NameBDBM50220142
Synonyms:CHEMBL62066
TypeSmall organic molecule
Emp. Form.C19H28N2O4
Mol. Mass.348.4366
SMILESCCOC(=O)N1CCN(CCCOc2ccc(cc2)C(=O)CC)CC1