Reaction Details
TargetHistamine H3 receptor
LigandBDBM50220100
Substrate/Competitorn/a
Meas. Tech.ChEBML_87054
Ki 21±n/a nM
Citation Faghih, RDwight, WGentles, RPhelan, KEsbenshade, TAIreland, LMiller, TRKang, CHFox, GBGopalakrishnan, SMHancock, AABennani, YL Structure-activity relationships of non-imidazole H(3) receptor ligands. Part 1. Bioorg Med Chem Lett12:2031-4 (2002) Histamine H3 receptor
Name:Histamine H3 receptor
Type:G Protein-Coupled Receptor (GPCR)
Mol. Mass.:48607.98
Organism:Rattus norvegicus (rat)
Description:n/a
Residue:445
BDBM50220100
NameBDBM50220100
Synonyms:CHEMBL60620
TypeSmall organic molecule
Emp. Form.C22H35N3O3
Mol. Mass.389.5316
SMILESCCCCCC(=O)c1ccc(OCCCN2CCN(CC2)C(=O)NCC)cc1