Reaction Details
TargetHistamine H2 receptor
LigandBDBM50220105
Substrate/Competitorn/a
Meas. Tech.ChEBML_85661
Ki 9550±n/a nM
Citation Faghih, RDwight, WGentles, RPhelan, KEsbenshade, TAIreland, LMiller, TRKang, CHFox, GBGopalakrishnan, SMHancock, AABennani, YL Structure-activity relationships of non-imidazole H(3) receptor ligands. Part 1. Bioorg Med Chem Lett12:2031-4 (2002) Histamine H2 receptor
Name:Histamine H2 receptor
Type:G Protein-Coupled Receptor (GPCR)
Mol. Mass.:40115.31
Organism:Homo sapiens (Human)
Description:n/a
Residue:359
BDBM50220105
NameBDBM50220105
Synonyms:CHEMBL59798
TypeSmall organic molecule
Emp. Form.C23H38N2O2
Mol. Mass.374.56
SMILESCCCCCC(=O)c1ccc(OCCCN2CCN(CC(C)C)CC2)cc1