Reaction Details
TargetHistamine H1 receptor
LigandBDBM50220416
Substrate/Competitorn/a
Meas. Tech.ChEMBL_84556 (CHEMBL692991)
Ki 1023±n/a nM
Citation Faghih, RDwight, WGentles, RPhelan, KEsbenshade, TAIreland, LMiller, TRKang, CHFox, GBGopalakrishnan, SMHancock, AABennani, YL Structure-activity relationships of non-imidazole H(3) receptor ligands. Part 1. Bioorg Med Chem Lett12:2031-4 (2002) Histamine H1 receptor
Name:Histamine H1 receptor
Type:G Protein-Coupled Receptor (GPCR)
Mol. Mass.:55808.72
Organism:Homo sapiens (Human)
Description:Cell pellets from SK-N-MC cells transfected with human H1 receptor were used in binding assay.
Residue:487
BDBM50220416
NameBDBM50220416
Synonyms:CHEMBL304027
TypeSmall organic molecule
Emp. Form.C23H26F2N2O4
Mol. Mass.432.4603
SMILESCCOC(=O)N1CCN(CCCOc2ccc(cc2)C(=O)c2cccc(F)c2F)CC1