Reaction Details
TargetHistamine H3 receptor
LigandBDBM50220334
Substrate/Competitorn/a
Meas. Tech.ChEMBL_87054 (CHEMBL697327)
Ki 59±n/a nM
Citation Faghih, RDwight, WGentles, RPhelan, KEsbenshade, TAIreland, LMiller, TRKang, CHFox, GBGopalakrishnan, SMHancock, AABennani, YL Structure-activity relationships of non-imidazole H(3) receptor ligands. Part 1. Bioorg Med Chem Lett12:2031-4 (2002) Histamine H3 receptor
Name:Histamine H3 receptor
Type:G Protein-Coupled Receptor (GPCR)
Mol. Mass.:48607.98
Organism:Rattus norvegicus (rat)
Description:n/a
Residue:445
BDBM50220334
NameBDBM50220334
Synonyms:CHEMBL2113738
TypeSmall organic molecule
Emp. Form.C24H30N2O4S
Mol. Mass.442.571
SMILESCCOC(=O)N1CCN(CCCOc2ccc(cc2)C(=O)c2ccc(SC)cc2)CC1