Reaction Details
TargetHistamine H2 receptor
LigandBDBM50220414
Substrate/Competitorn/a
Meas. Tech.ChEMBL_85661 (CHEMBL702652)
Ki 27542±n/a nM
Citation Faghih, RDwight, WGentles, RPhelan, KEsbenshade, TAIreland, LMiller, TRKang, CHFox, GBGopalakrishnan, SMHancock, AABennani, YL Structure-activity relationships of non-imidazole H(3) receptor ligands. Part 1. Bioorg Med Chem Lett12:2031-4 (2002) Histamine H2 receptor
Name:Histamine H2 receptor
Type:G Protein-Coupled Receptor (GPCR)
Mol. Mass.:40115.31
Organism:Homo sapiens (Human)
Description:n/a
Residue:359
BDBM50220414
NameBDBM50220414
Synonyms:CHEMBL60509
TypeSmall organic molecule
Emp. Form.C23H31N3O4
Mol. Mass.413.5099
SMILESCCCCCC(=O)c1ccc(OCCCN2CCN(CC2)C(=O)c2cnco2)cc1