Reaction Details
TargetHistamine H2 receptor
LigandBDBM50220213
Substrate/Competitorn/a
Meas. Tech.ChEMBL_85661 (CHEMBL702652)
Ki 6761±n/a nM
Citation Faghih, RDwight, WGentles, RPhelan, KEsbenshade, TAIreland, LMiller, TRKang, CHFox, GBGopalakrishnan, SMHancock, AABennani, YL Structure-activity relationships of non-imidazole H(3) receptor ligands. Part 1. Bioorg Med Chem Lett12:2031-4 (2002) Histamine H2 receptor
Name:Histamine H2 receptor
Type:G Protein-Coupled Receptor (GPCR)
Mol. Mass.:40115.31
Organism:Homo sapiens (Human)
Description:n/a
Residue:359
BDBM50220213
NameBDBM50220213
Synonyms:CHEMBL292275
TypeSmall organic molecule
Emp. Form.C26H32N2O5
Mol. Mass.452.5427
SMILESCCOC(=O)N1CCN(CCCOc2ccc(cc2)C(=O)\C=C\c2ccc(OC)cc2)CC1