Reaction Details
TargetHistamine H3 receptor
LigandBDBM50220338
Substrate/Competitorn/a
Meas. Tech.ChEMBL_87054 (CHEMBL697327)
Ki 2.1±n/a nM
Citation Faghih, RDwight, WGentles, RPhelan, KEsbenshade, TAIreland, LMiller, TRKang, CHFox, GBGopalakrishnan, SMHancock, AABennani, YL Structure-activity relationships of non-imidazole H(3) receptor ligands. Part 1. Bioorg Med Chem Lett12:2031-4 (2002) Histamine H3 receptor
Name:Histamine H3 receptor
Type:G Protein-Coupled Receptor (GPCR)
Mol. Mass.:48607.98
Organism:Rattus norvegicus (rat)
Description:n/a
Residue:445
BDBM50220338
NameBDBM50220338
Synonyms:CHEMBL302886
TypeSmall organic molecule
Emp. Form.C23H34N2O3
Mol. Mass.386.5277
SMILESCCCCCC(=O)c1ccc(OCCCN2CCN(CC2)C(=O)C2CC2)cc1