Reaction Details
TargetTryptase delta
LigandBDBM50217599
Substrate/Competitorn/a
Meas. Tech.ChEMBL_88854 (CHEMBL697873)
IC50 1.000000±n/a nM
Citation Sutton, JCBolton, SAHartl, KSHuang, MHJacobs, GMeng, WOgletree, MLPi, ZSchumacher, WASeiler, SMSlusarchyk, WATreuner, UZahler, RZhao, GBisacchi, GS Synthesis and SAR of 4-carboxy-2-azetidinone mechanism-based tryptase inhibitors. Bioorg Med Chem Lett12:3229-33 (2002) Tryptase delta
Name:Tryptase delta
Type:PROTEIN
Mol. Mass.:26578.73
Organism:Homo sapiens (Human)
Description:ChEMBL_104777
Residue:242
BDBM50217599
NameBDBM50217599
Synonyms:CHEMBL109888
TypeSmall organic molecule
Emp. Form.C20H22N4O5S
Mol. Mass.430.477
SMILESNC(=N)NCCC[C@@H]1[C@H](N(C1=O)S(=O)(=O)c1ccc(cc1)-c1ccccc1)C(O)=O