Reaction Details
TargetTryptase delta
LigandBDBM50217622
Substrate/Competitorn/a
Meas. Tech.ChEMBL_88854 (CHEMBL697873)
IC50 1.000000±n/a nM
Citation Sutton, JCBolton, SAHartl, KSHuang, MHJacobs, GMeng, WOgletree, MLPi, ZSchumacher, WASeiler, SMSlusarchyk, WATreuner, UZahler, RZhao, GBisacchi, GS Synthesis and SAR of 4-carboxy-2-azetidinone mechanism-based tryptase inhibitors. Bioorg Med Chem Lett12:3229-33 (2002) Tryptase delta
Name:Tryptase delta
Type:PROTEIN
Mol. Mass.:26578.73
Organism:Homo sapiens (Human)
Description:ChEMBL_104777
Residue:242
BDBM50217622
NameBDBM50217622
Synonyms:CHEMBL443539
TypeSmall organic molecule
Emp. Form.C13H16N4O4S
Mol. Mass.324.356
SMILESNC(=N)NCCC[C@@H]1[C@H](N(C(=O)c2cccs2)C1=O)C(O)=O