Reaction Details
TargetTryptase delta
LigandBDBM50217627
Substrate/Competitorn/a
Meas. Tech.ChEMBL_88854 (CHEMBL697873)
IC50 0.700000±n/a nM
Citation Sutton, JCBolton, SAHartl, KSHuang, MHJacobs, GMeng, WOgletree, MLPi, ZSchumacher, WASeiler, SMSlusarchyk, WATreuner, UZahler, RZhao, GBisacchi, GS Synthesis and SAR of 4-carboxy-2-azetidinone mechanism-based tryptase inhibitors. Bioorg Med Chem Lett12:3229-33 (2002) Tryptase delta
Name:Tryptase delta
Type:PROTEIN
Mol. Mass.:26578.73
Organism:Homo sapiens (Human)
Description:ChEMBL_104777
Residue:242
BDBM50217627
NameBDBM50217627
Synonyms:CHEMBL110061
TypeSmall organic molecule
Emp. Form.C19H33N7O5
Mol. Mass.439.5092
SMILES[#6]-[#7]-[#6](=O)-[#6@@H]-1-[#6@@H](-[#6]-[#6]-[#6]\[#7]=[#6](/[#7])-[#7])-[#6](=O)-[#7]-1-[#6](=O)-[#7]-1-[#6]-[#6]-[#7](-[#6]-[#6]-1)-[#6](=O)-[#8]C([#6])([#6])[#6]