Reaction Details
TargetTryptase delta
LigandBDBM50217813
Substrate/Competitorn/a
Meas. Tech.ChEMBL_210701 (CHEMBL817298)
IC50 4.0±n/a nM
Citation Slusarchyk, WABolton, SAHartl, KSHuang, MHJacobs, GMeng, WOgletree, MLPi, ZSchumacher, WASeiler, SMSutton, JCTreuner, UZahler, RZhao, GBisacchi, GS Synthesis of potent and highly selective inhibitors of human tryptase. Bioorg Med Chem Lett12:3235-8 (2002) Tryptase delta
Name:Tryptase delta
Type:PROTEIN
Mol. Mass.:26578.73
Organism:Homo sapiens (Human)
Description:ChEMBL_104777
Residue:242
BDBM50217813
NameBDBM50217813
Synonyms:CHEMBL302058
TypeSmall organic molecule
Emp. Form.C21H36N6O6
Mol. Mass.468.5471
SMILES[#6]-[#6](-[#6])-[#6](-[#8]-[#6](=O)-[#7]-1-[#6]-[#6]-[#7](-[#6]-[#6]-1)-[#6](=O)-[#7]-1-[#6@@H](-[#6@@H](-[#6]-[#6]-[#6]\[#7]=[#6](/[#7])-[#7])-[#6]-1=O)-[#6](-[#8])=O)-[#6](-[#6])-[#6]