Reaction Details
TargetTryptase delta
LigandBDBM50120368
Substrate/Competitorn/a
Meas. Tech.ChEMBL_210701 (CHEMBL817298)
IC50 4.0±n/a nM
Citation Slusarchyk, WABolton, SAHartl, KSHuang, MHJacobs, GMeng, WOgletree, MLPi, ZSchumacher, WASeiler, SMSutton, JCTreuner, UZahler, RZhao, GBisacchi, GS Synthesis of potent and highly selective inhibitors of human tryptase. Bioorg Med Chem Lett12:3235-8 (2002) Tryptase delta
Name:Tryptase delta
Type:PROTEIN
Mol. Mass.:26578.73
Organism:Homo sapiens (Human)
Description:ChEMBL_104777
Residue:242
BDBM50120368
NameBDBM50120368
Synonyms:(2S,3R)-1-(4-tert-Butylcarbamoyl-piperazine-1-carbonyl)-3-(3-guanidino-propyl)-4-oxo-azetidine-2-carboxylic acid (R)-1-(4-tert-Butylcarbamoyl-piperazine-1-carbonyl)-3-(3-guanidino-propyl)-4-oxo-azetidine-2-carboxylic acid BMS-262084 | CHEMBL71037
TypeSmall organic molecule
Emp. Form.C18H31N7O5
Mol. Mass.425.4826
SMILESCC(C)(C)NC(=O)N1CCN(CC1)C(=O)N1[C@@H]([C@@H](CCCNC(N)=N)C1=O)C(O)=O