Reaction Details
TargetTryptase delta
LigandBDBM50217819
Substrate/Competitorn/a
Meas. Tech.ChEMBL_210701 (CHEMBL817298)
IC50 1.9±n/a nM
Citation Slusarchyk, WABolton, SAHartl, KSHuang, MHJacobs, GMeng, WOgletree, MLPi, ZSchumacher, WASeiler, SMSutton, JCTreuner, UZahler, RZhao, GBisacchi, GS Synthesis of potent and highly selective inhibitors of human tryptase. Bioorg Med Chem Lett12:3235-8 (2002) Tryptase delta
Name:Tryptase delta
Type:PROTEIN
Mol. Mass.:26578.73
Organism:Homo sapiens (Human)
Description:ChEMBL_104777
Residue:242
BDBM50217819
NameBDBM50217819
Synonyms:CHEMBL109504
TypeSmall organic molecule
Emp. Form.C28H46N6O5
Mol. Mass.546.702
SMILESNC(=N)N1CCCC(C[C@@H]2[C@H](N(C(=O)N3CCN(CC3)C(=O)CCCCCC3CCCCC3)C2=O)C(O)=O)C1