Reaction Details
TargetVoltage-dependent L-type calcium channel subunit alpha-1S
LigandBDBM50103634
Substrate/Competitorn/a
Meas. Tech.ChEMBL_177580 (CHEMBL783655)
IC50 1.0±n/a nM
Citation Cho, HUeda, MShima, KMizuno, AHayashimatsu, MOhnaka, YTakeuchi, YHamaguchi, MAisaka, KHidaka, T Dihydropyrimidines: novel calcium antagonists with potent and long-lasting vasodilative and antihypertensive activity. J Med Chem32:2399-406 (1989) Voltage-dependent L-type calcium channel subunit alpha-1S
Name:Voltage-dependent L-type calcium channel subunit alpha-1S
Type:PROTEIN
Mol. Mass.:210392.58
Organism:Rattus norvegicus
Description:ChEMBL_92777
Residue:1850
BDBM50103634
NameBDBM50103634
Synonyms:CL-287389 Nilvadipine SK&F-102362
TypeSmall organic molecule
Emp. Form.C19H19N3O6
Mol. Mass.385.3707
SMILESCOC(=O)C1=C(NC(C)=C(C1c1cccc(c1)[N+]([O-])=O)C(=O)OC(C)C)C#N