Reaction Details
TargetCoagulation factor XI
LigandBDBM50230329
Substrate/Competitorn/a
Meas. Tech.ChEBML_1644767
Ki 27±n/a nM
Citation Corte, JRFang, TOsuna, HPinto, DJRossi, KAMyers, JESheriff, SLou, ZZheng, JJHarper, TWBozarth, JMWu, YLuettgen, JMSeiffert, DADecicco, CPWexler, RRQuan, ML Structure-Based Design of Macrocyclic Factor XIa Inhibitors: Discovery of the Macrocyclic Amide Linker. J Med Chem60:1060-1075 (2017) 
 
Coagulation factor XI
Name:Coagulation factor XI
Type:Enzyme
Mol. Mass.:70130.58
Organism:Homo sapiens (Human)
Description:P03951
Residue:625
BDBM50230329
NameBDBM50230329
Synonyms:CHEMBL4079002
TypeSmall organic molecule
Emp. Form.C28H28ClN9O4
Mol. Mass.590.033
SMILESCCC(=O)Nc1cc(NC(=O)OC)ccc1-c1c[nH]c(n1)[C@H](CC=C)NC(=O)\C=C\c1cc(Cl)ccc1-n1cnnn1