Reaction Details
TargetVitamin K-dependent protein C
LigandBDBM50063669
Substrate/Competitorn/a
Meas. Tech.ChEBML_1644778
Ki>21500±n/a nM
Citation Corte, JRFang, TOsuna, HPinto, DJRossi, KAMyers, JESheriff, SLou, ZZheng, JJHarper, TWBozarth, JMWu, YLuettgen, JMSeiffert, DADecicco, CPWexler, RRQuan, ML Structure-Based Design of Macrocyclic Factor XIa Inhibitors: Discovery of the Macrocyclic Amide Linker. J Med Chem60:1060-1075 (2017) 
 
Vitamin K-dependent protein C
Name:Vitamin K-dependent protein C
Type:Enzyme
Mol. Mass.:52067.73
Organism:Homo sapiens (Human)
Description:n/a
Residue:461
BDBM50063669
NameBDBM50063669
Synonyms:CHEMBL3398641
TypeSmall organic molecule
Emp. Form.C29H24Cl2N8O3
Mol. Mass.603.459
SMILESCOC(=O)Nc1ccc(cc1)-c1nc([nH]c1Cl)[C@H](Cc1ccccc1)NC(=O)\C=C\c1cc(Cl)ccc1-n1cnnn1