Reaction Details
TargetUrokinase-type plasminogen activator
LigandBDBM47108
Substrate/Competitorn/a
Meas. Tech.ChEMBL_1644781 (CHEMBL3993710)
Ki>15100±n/a nM
Citation Corte, JRFang, TOsuna, HPinto, DJRossi, KAMyers, JESheriff, SLou, ZZheng, JJHarper, TWBozarth, JMWu, YLuettgen, JMSeiffert, DADecicco, CPWexler, RRQuan, ML Structure-Based Design of Macrocyclic Factor XIa Inhibitors: Discovery of the Macrocyclic Amide Linker. J Med Chem60:1060-1075 (2017) 
 
Urokinase-type plasminogen activator
Name:Urokinase-type plasminogen activator
Type:Enzyme
Mol. Mass.:48528.62
Organism:Homo sapiens (Human)
Description:P00749
Residue:431
BDBM47108
NameBDBM47108
Synonyms:US10487086, Example 10 US8828983, 10 US9802939, 10
Typen/a
Emp. Form.C27H26ClN9O4
Mol. Mass.576.006
SMILESCOC(=O)Nc1ccc2-c3c[nH]c(n3)[C@H](CCCCC(=O)Nc2c1)NC(=O)\C=C\c1cc(Cl)ccc1-n1cnnn1