Reaction Details
TargetCoagulation factor IX
LigandBDBM47108
Substrate/Competitorn/a
Meas. Tech.ChEMBL_1644772 (CHEMBL3993701)
Ki>27100±n/a nM
Citation Corte, JRFang, TOsuna, HPinto, DJRossi, KAMyers, JESheriff, SLou, ZZheng, JJHarper, TWBozarth, JMWu, YLuettgen, JMSeiffert, DADecicco, CPWexler, RRQuan, ML Structure-Based Design of Macrocyclic Factor XIa Inhibitors: Discovery of the Macrocyclic Amide Linker. J Med Chem60:1060-1075 (2017) 
 
Coagulation factor IX
Name:Coagulation factor IX
Type:Enzyme
Mol. Mass.:51768.83
Organism:Homo sapiens (Human)
Description:P00740
Residue:461
BDBM47108
NameBDBM47108
Synonyms:US10487086, Example 10 US8828983, 10 US9802939, 10
Typen/a
Emp. Form.C27H26ClN9O4
Mol. Mass.576.006
SMILESCOC(=O)Nc1ccc2-c3c[nH]c(n3)[C@H](CCCCC(=O)Nc2c1)NC(=O)\C=C\c1cc(Cl)ccc1-n1cnnn1