Reaction Details
TargetFarnesyl pyrophosphate synthase
LigandBDBM50235468
Substrate/Competitorn/a
Meas. Tech.ChEMBL_1657315 (CHEMBL4006785)
IC50 3000±n/a nM
Citation Park, JLeung, CYMatralis, ANLacbay, CMTsakos, MFernandez De Troconiz, GBerghuis, AMTsantrizos, YS Pharmacophore Mapping of Thienopyrimidine-Based Monophosphonate (ThP-MP) Inhibitors of the Human Farnesyl Pyrophosphate Synthase. J Med Chem60:2119-2134 (2017) 
 
Farnesyl pyrophosphate synthase
Name:Farnesyl pyrophosphate synthase
Type:Enzyme
Mol. Mass.:48272.89
Organism:Homo sapiens (Human)
Description:P14324
Residue:419
BDBM50235468
NameBDBM50235468
Synonyms:CHEMBL4073585
TypeSmall organic molecule
Emp. Form.C22H20N3O4PS
Mol. Mass.453.451
SMILESCc1ccc(cc1)-c1cc2c(NC(c3ccc4OCCc4c3)P(O)(O)=O)ncnc2s1