Reaction Details
TargetFarnesyl pyrophosphate synthase
LigandBDBM50235477
Substrate/Competitorn/a
Meas. Tech.ChEMBL_1657315 (CHEMBL4006785)
IC50 4600±n/a nM
Citation Park, JLeung, CYMatralis, ANLacbay, CMTsakos, MFernandez De Troconiz, GBerghuis, AMTsantrizos, YS Pharmacophore Mapping of Thienopyrimidine-Based Monophosphonate (ThP-MP) Inhibitors of the Human Farnesyl Pyrophosphate Synthase. J Med Chem60:2119-2134 (2017) 
 
Farnesyl pyrophosphate synthase
Name:Farnesyl pyrophosphate synthase
Type:Enzyme
Mol. Mass.:48272.89
Organism:Homo sapiens (Human)
Description:P14324
Residue:419
BDBM50235477
NameBDBM50235477
Synonyms:CHEMBL4093024
TypeSmall organic molecule
Emp. Form.C15H15FN3O4PS
Mol. Mass.383.334
SMILESCOc1cc(C)c(F)cc1-c1cc2c(NCP(O)(O)=O)ncnc2s1