Reaction Details
TargetPolycomb protein EED
LigandBDBM50235996
Substrate/Competitorn/a
Meas. Tech.ChEBML_1658555
IC50 9.0±n/a nM
Citation Huang, YZhang, JYu, ZZhang, HWang, YLingel, AQi, WGu, JZhao, KShultz, MDWang, LFu, XSun, YZhang, QJiang, XZhang, JZhang, CLi, LZeng, JFeng, LZhang, CLiu, YZhang, MZhang, LZhao, MGao, ZLiu, XFang, DGuo, HMi, YGabriel, TDillon, MPAtadja, POyang, C Discovery of First-in-Class, Potent, and Orally Bioavailable Embryonic Ectoderm Development (EED) Inhibitor with Robust Anticancer Efficacy. J Med Chem60:2215-2226 (2017) 
 
Polycomb protein EED
Name:Polycomb protein EED
Type:Protein
Mol. Mass.:50201.68
Organism:Homo sapiens (Human)
Description:O75530
Residue:441
BDBM50235996
NameBDBM50235996
Synonyms:CHEMBL4079806
TypeSmall organic molecule
Emp. Form.C21H20N6O
Mol. Mass.372.4231
SMILESCN(C)Cc1ccc(cc1)-c1cc(C#N)c(NCc2ccoc2)n2cnnc12