Reaction Details
TargetPolycomb protein EED
LigandBDBM50236023
Substrate/Competitorn/a
Meas. Tech.ChEMBL_1658554 (CHEMBL4008166)
IC50 53±n/a nM
Citation Huang, YZhang, JYu, ZZhang, HWang, YLingel, AQi, WGu, JZhao, KShultz, MDWang, LFu, XSun, YZhang, QJiang, XZhang, JZhang, CLi, LZeng, JFeng, LZhang, CLiu, YZhang, MZhang, LZhao, MGao, ZLiu, XFang, DGuo, HMi, YGabriel, TDillon, MPAtadja, POyang, C Discovery of First-in-Class, Potent, and Orally Bioavailable Embryonic Ectoderm Development (EED) Inhibitor with Robust Anticancer Efficacy. J Med Chem60:2215-2226 (2017) 
 
Polycomb protein EED
Name:Polycomb protein EED
Type:Protein
Mol. Mass.:50201.68
Organism:Homo sapiens (Human)
Description:O75530
Residue:441
BDBM50236023
NameBDBM50236023
Synonyms:CHEMBL4081454
TypeSmall organic molecule
Emp. Form.C19H19ClN6S
Mol. Mass.398.912
SMILESCN(C)Cc1ccc(cc1)-c1cnc(NCc2sccc2Cl)n2cnnc12